BDBM50284609 CHEMBL278762::N-((R)-1-Butyl-pyrrolidin-2-ylmethyl)-2-methoxy-5-sulfamoyl-benzamide
SMILES CCCCN1CCC[C@@H]1CNC(=O)c1cc(ccc1OC)S(N)(=O)=O
InChI Key InChIKey=OBOHWJBYXZNLJD-CYBMUJFWSA-N
Data  3 KI
  Tab Delimited (TSV)   2D SDfile   Computed 3D by Vconf -m prep SDfile
Find this compound or compounds like it in BindingDB:
Activity Spreadsheet -- Enzyme Inhibition Constant Data from BindingDB
Found 3 hits for monomerid = 50284609
TargetD(2) dopamine receptor(Rattus norvegicus (rat))
Yoshitomi Pharmaceutical Industries
Curated by ChEMBL
LigandPNGBDBM50284609(CHEMBL278762 | N-((R)-1-Butyl-pyrrolidin-2-ylmethy...)
Affinity DataKi:  230nM. Assay description: Binding affinity towards dopamine receptor D2 using as [3H]-spiperone radioligand.
In DepthDetails ArticlePubMed
TargetD(2) dopamine receptor(Rattus norvegicus (rat))
Yoshitomi Pharmaceutical Industries
Curated by ChEMBL
LigandPNGBDBM50284609(CHEMBL278762 | N-((R)-1-Butyl-pyrrolidin-2-ylmethy...)
Affinity DataKi:  230nM. Assay description: Compound was evaluated for its ability to displace [3H]-spiperone from D2 dopamine receptor isolated from the striata of male Wistar rats
In DepthDetails Article
Target5-hydroxytryptamine receptor 1A(Rattus norvegicus (rat))
TBA
Curated by ChEMBL
LigandPNGBDBM50284609(CHEMBL278762 | N-((R)-1-Butyl-pyrrolidin-2-ylmethy...)
Affinity DataKi:  4.50E+3nM. Assay description: Compound was evaluated for its ability to displace [3H]-8-OH-DPAT from serotonergic 5-hydroxytryptamine 1A receptor
In DepthDetails Article