BDBM50285153 2-{1-[1-(2-carboxy-1-{1-[2-(10,11-dihydro-5H-dibenzo[a,d]cyclohepten-5-yl)-2-methylcarboxamidoacetyl]tetrahydro-1H-2-pyrrolylcarboxamido}ethylcarboxamido)-2-methylbutylcarboxamido]-2-methylbutylcarboxamido}-3-(1H-3-indolyl)propanoic acid::CHEMBL2373085
SMILES CC[C@H](C)[C@H](NC(=O)[C@@H](NC(=O)[C@H](CC(O)=O)NC(=O)[C@@H]1CCCN1C(=O)[C@H](NC(C)=O)C1c2ccccc2CCc2ccccc12)[C@@H](C)CC)C(=O)N[C@@H](Cc1c[nH]c2ccccc12)C(O)=O
InChI Key InChIKey=GJDLXEPPTKJHNQ-DXCYWJGUSA-N
Data  1 IC50
  Tab Delimited (TSV)   2D SDfile   Computed 3D by Vconf -m prep SDfile
Find this compound or compounds like it in BindingDB:
Activity Spreadsheet -- Enzyme Inhibition Constant Data from BindingDB
Found 1 hit for monomerid = 50285153
TargetEndothelin-1 receptor(Sus scrofa)
TBA
Curated by ChEMBL
LigandPNGBDBM50285153(2-{1-[1-(2-carboxy-1-{1-[2-(10,11-dihydro-5H-diben...)
Affinity DataIC50:  6nM. Assay description: Antagonist activity against ET-A from porcine heart membranes
In DepthDetails Article