BDBM50285283 2,6-Dichloro-benzoic acid 4,6-dimethoxy-1,1,3-trioxo-1,3-dihydro-1lambda*6*-benzo[d]isothiazol-2-ylmethyl ester::CHEMBL12051
SMILES COc1cc2c(C(=O)N(COC(=O)c3c(Cl)cccc3Cl)S2(=O)=O)c(OC)c1
InChI Key InChIKey=SJVAVJFCYQMQJM-UHFFFAOYSA-N
Data  1 KI
  Tab Delimited (TSV)   2D SDfile   Computed 3D by Vconf -m prep SDfile
Find this compound or compounds like it in BindingDB:
Activity Spreadsheet -- Enzyme Inhibition Constant Data from BindingDB
Found 1 hit for monomerid = 50285283
TargetNeutrophil elastase(Homo sapiens (Human))
TBA
Curated by ChEMBL
LigandPNGBDBM50285283(2,6-Dichloro-benzoic acid 4,6-dimethoxy-1,1,3-trio...)
Affinity DataKi:  0.0800nM. Assay description: Inhibition of Human Leukocyte Elastase (HLE) as apparent binding constant (kreact/kinact)
In DepthDetails Article