BDBM50286721 (S)-1-[(S)-2-((S)-2-Mercapto-3-phenyl-propionylamino)-3-naphthalen-1-yl-propionyl]-pyrrolidine-2-carboxylic acid::CHEMBL351318
SMILES OC(=O)[C@@H]1CCCN1C(=O)[C@H](Cc1cccc2ccccc12)NC(=O)[C@@H](S)Cc1ccccc1
InChI Key InChIKey=PFSPSDHEYBMTQM-HJOGWXRNSA-N
Data  2 IC50
  Tab Delimited (TSV)   2D SDfile   Computed 3D by Vconf -m prep SDfile
Find this compound or compounds like it in BindingDB:
Activity Spreadsheet -- Enzyme Inhibition Constant Data from BindingDB
Found 2 hits for monomerid = 50286721
TargetAngiotensin-converting enzyme 2(Homo sapiens (Human))
TBA
Curated by ChEMBL
LigandPNGBDBM50286721((S)-1-[(S)-2-((S)-2-Mercapto-3-phenyl-propionylami...)
Affinity DataIC50:  14nM. Assay description: Inhibition of angiotensin converting enzyme (ACE)
In DepthDetails Article
TargetNeprilysin(Rattus norvegicus (Rat))
TBA
Curated by ChEMBL
LigandPNGBDBM50286721((S)-1-[(S)-2-((S)-2-Mercapto-3-phenyl-propionylami...)
Affinity DataIC50: >1.00E+3nM. Assay description: Inhibition of neutral endopeptidase (NEP) 24.11
In DepthDetails Article