BDBM50287289 2-Chloro-N-[5-ethyl-3-[2'-(1H-tetrazol-5-yl)-biphenyl-4-ylmethyl]-3H-[1,3,4]thiadiazol-(2Z)-ylidene]-benzamide::CHEMBL287116
SMILES CCc1nn(Cc2ccc(cc2)-c2ccccc2-c2nnn[nH]2)c(=NC(=O)c2ccccc2Cl)s1
InChI Key InChIKey=ZUKXIXVNPIDHHS-UHFFFAOYSA-N
Data  1 KI  1 IC50
  Tab Delimited (TSV)   2D SDfile   Computed 3D by Vconf -m prep SDfile
Find this compound or compounds like it in BindingDB:
Activity Spreadsheet -- Enzyme Inhibition Constant Data from BindingDB
Found 2 hits for monomerid = 50287289
LigandPNGBDBM50287289(2-Chloro-N-[5-ethyl-3-[2'-(1H-tetrazol-5-yl)-biphe...)
Affinity DataKi:  3.40nM. Assay description: Inhibition of binding of [125I]All at the angiotensin II type 1 receptor (AT1 receptor) in rat liver membranes
In DepthDetails
LigandPNGBDBM50287289(2-Chloro-N-[5-ethyl-3-[2'-(1H-tetrazol-5-yl)-biphe...)
Affinity DataIC50:  3.60nM. Assay description: Compound was tested in vitro for the ability to displace the specific binding of [125I]-A II from receptors in rat liver membrane(type 1 receptor)
In DepthDetails Article