BDBM50287670 4-Phenyl-5-tridecyl-4H-[1,2,4]triazole-3-thiol::CHEMBL61135::PD-140195
SMILES CCCCCCCCCCCCCc1n[nH]c(=S)n1-c1ccccc1
InChI Key InChIKey=GILIMJSCUOWWRU-UHFFFAOYSA-N
Data  1 IC50
  Tab Delimited (TSV)   2D SDfile   Computed 3D by Vconf -m prep SDfile
Find this compound or compounds like it in BindingDB:
Activity Spreadsheet -- Enzyme Inhibition Constant Data from BindingDB
Found 1 hit for monomerid = 50287670
TargetCholesteryl ester transfer protein(Homo sapiens (Human))
TBA
Curated by ChEMBL
LigandPNGBDBM50287670(4-Phenyl-5-tridecyl-4H-[1,2,4]triazole-3-thiol | C...)
Affinity DataIC50:  1.50E+3nM. Assay description: Tested for inhibition of [3H]-cholesteryl linoleate(CE) transfer from donor HDL to acceptor LDL driven by recombinant human Cholesteryl ester transfe...
In DepthDetails Article