BDBM50288074 (2-Benzyl-2-mercaptomethyl-3-phenyl-propionylamino)-acetic acid::CHEMBL263756
SMILES OC(=O)CNC(=O)C(CS)(Cc1ccccc1)Cc1ccccc1
InChI Key InChIKey=UTBNVDPRAQLZDU-UHFFFAOYSA-N
Data  1 KI
  Tab Delimited (TSV)   2D SDfile   Computed 3D by Vconf -m prep SDfile
Find this compound or compounds like it in BindingDB:
Activity Spreadsheet -- Enzyme Inhibition Constant Data from BindingDB
Found 1 hit for monomerid = 50288074
TargetNeprilysin(Homo sapiens (Human))
TBA
Curated by ChEMBL
LigandPNGBDBM50288074((2-Benzyl-2-mercaptomethyl-3-phenyl-propionylamino...)
Affinity DataKi: >100nM. Assay description: Compound was evaluated for inhibition of recombinant human neprilysin(NEP).
In DepthDetails Article