BDBM50288075 ((Z)-2-Mercaptomethyl-3-phenyl-acryloylamino)-acetic acid::CHEMBL312460
SMILES OC(=O)CNC(=O)C(\CS)=C\c1ccccc1
InChI Key InChIKey=IUNNFKOTRMKCLB-UXBLZVDNSA-N
Data  1 KI
  Tab Delimited (TSV)   2D SDfile   Computed 3D by Vconf -m prep SDfile
Find this compound or compounds like it in BindingDB:
Activity Spreadsheet -- Enzyme Inhibition Constant Data from BindingDB
Found 1 hit for monomerid = 50288075
TargetNeprilysin(Homo sapiens (Human))
TBA
Curated by ChEMBL
LigandPNGBDBM50288075(((Z)-2-Mercaptomethyl-3-phenyl-acryloylamino)-acet...)
Affinity DataKi:  408nM. Assay description: Compound was evaluated for inhibition of recombinant human neprilysin(NEP).
In DepthDetails Article