BDBM50288679 CHEMBL325835::[(S)-2-((S)-3-Methyl-1-phenylcarbamoyl-butylcarbamoyl)-4-phenyl-butyl]-(4-phenylacetylamino-butyl)-phosphinic acid
SMILES CC(C)C[C@H](NC(=O)[C@H](CCc1ccccc1)CP(O)(=O)CCCCNC(=O)Cc1ccccc1)C(=O)Nc1ccccc1
InChI Key InChIKey=AYKWMGZBLRUSIJ-BHYZAODMSA-N
Data  2 KI
  Tab Delimited (TSV)   2D SDfile   Computed 3D by Vconf -m prep SDfile
Find this compound or compounds like it in BindingDB:
Activity Spreadsheet -- Enzyme Inhibition Constant Data from BindingDB
Found 2 hits for monomerid = 50288679
TargetStromelysin-1(Homo sapiens (Human))
TBA
Curated by ChEMBL
LigandPNGBDBM50288679(CHEMBL325835 | [(S)-2-((S)-3-Methyl-1-phenylcarbam...)
Affinity DataKi:  30nM. Assay description: Inhibition of stromelysin-1 (MMP-3).
In DepthDetails Article
Target72 kDa type IV collagenase(Homo sapiens (Human))
TBA
Curated by ChEMBL
LigandPNGBDBM50288679(CHEMBL325835 | [(S)-2-((S)-3-Methyl-1-phenylcarbam...)
Affinity DataKi:  130nM. Assay description: Inhibition of gelatinase-A (MMP-2).
In DepthDetails Article