BDBM50288693 (4-Methoxycarbonylamino-butyl)-[(S)-2-((S)-3-methyl-1-phenylcarbamoyl-butylcarbamoyl)-4-phenyl-butyl]-phosphinic acid::CHEMBL325574
SMILES COC(=O)NCCCCP(O)(=O)C[C@@H](CCc1ccccc1)C(=O)N[C@@H](CC(C)C)C(=O)Nc1ccccc1
InChI Key InChIKey=DPHTYOHAIZCUCJ-RSXGOPAZSA-N
Data  1 KI
  Tab Delimited (TSV)   2D SDfile   Computed 3D by Vconf -m prep SDfile
Find this compound or compounds like it in BindingDB:
Activity Spreadsheet -- Enzyme Inhibition Constant Data from BindingDB
Found 1 hit for monomerid = 50288693
TargetStromelysin-1(Homo sapiens (Human))
TBA
Curated by ChEMBL
LigandPNGBDBM50288693((4-Methoxycarbonylamino-butyl)-[(S)-2-((S)-3-methy...)
Affinity DataKi:  54nM. Assay description: Inhibition of stromelysin-1 (MMP-3).
In DepthDetails Article