BDBM50288694 CHEMBL322142::[(S)-2-((S)-3-Methyl-1-phenylcarbamoyl-butylcarbamoyl)-4-phenyl-butyl]-(4-phenoxycarbonylamino-butyl)-phosphinic acid
SMILES CC(C)C[C@H](NC(=O)[C@H](CCc1ccccc1)CP(O)(=O)CCCCNC(=O)Oc1ccccc1)C(=O)Nc1ccccc1
InChI Key InChIKey=IXVVVBIIUONGJK-MVSFAKPFSA-N
Data  1 KI
  Tab Delimited (TSV)   2D SDfile   Computed 3D by Vconf -m prep SDfile
Find this compound or compounds like it in BindingDB:
Activity Spreadsheet -- Enzyme Inhibition Constant Data from BindingDB
Found 1 hit for monomerid = 50288694
TargetStromelysin-1(Homo sapiens (Human))
TBA
Curated by ChEMBL
LigandPNGBDBM50288694(CHEMBL322142 | [(S)-2-((S)-3-Methyl-1-phenylcarbam...)
Affinity DataKi:  56nM. Assay description: Inhibition of stromelysin-1 (MMP-3).
In DepthDetails Article