BDBM50288705 (R)-2-[(S)-1-((S)-3-Methyl-1-phenylcarbamoyl-butylcarbamoyl)-3-phenyl-propylamino]-5-phenylacetylamino-pentanoic acid::CHEMBL113322
SMILES CC(C)C[C@H](NC(=O)[C@H](CCc1ccccc1)N[C@H](CCCNC(=O)Cc1ccccc1)C(O)=O)C(=O)Nc1ccccc1
InChI Key InChIKey=DGFULAROBOKMBD-YPKYBTACSA-N
Data  3 KI
  Tab Delimited (TSV)   2D SDfile   Computed 3D by Vconf -m prep SDfile
Find this compound or compounds like it in BindingDB:
Activity Spreadsheet -- Enzyme Inhibition Constant Data from BindingDB
Found 3 hits for monomerid = 50288705
TargetStromelysin-1(Homo sapiens (Human))
TBA
Curated by ChEMBL
LigandPNGBDBM50288705((R)-2-[(S)-1-((S)-3-Methyl-1-phenylcarbamoyl-butyl...)
Affinity DataKi:  10nM. Assay description: Inhibition of MMP-3.
In DepthDetails Article
Target72 kDa type IV collagenase(Homo sapiens (Human))
TBA
Curated by ChEMBL
LigandPNGBDBM50288705((R)-2-[(S)-1-((S)-3-Methyl-1-phenylcarbamoyl-butyl...)
Affinity DataKi:  60nM. Assay description: Inhibition of MMP-2.
In DepthDetails Article
TargetInterstitial collagenase(Homo sapiens (Human))
TBA
Curated by ChEMBL
LigandPNGBDBM50288705((R)-2-[(S)-1-((S)-3-Methyl-1-phenylcarbamoyl-butyl...)
Affinity DataKi:  870nM. Assay description: Inhibition of matrix metalloproteinase -1.
In DepthDetails Article