BDBM50289028 CHEMBL163615::N-(2,6-Diisopropyl-phenyl)-malonamic acid tetradecyl ester
SMILES CCCCCCCCCCCCCCOC(=O)CC(=O)Nc1c(cccc1C(C)C)C(C)C
InChI Key InChIKey=XDXFTDXTUFVUFM-UHFFFAOYSA-N
Data  1 IC50
  Tab Delimited (TSV)   2D SDfile   Computed 3D by Vconf -m prep SDfile
Find this compound or compounds like it in BindingDB:
Activity Spreadsheet -- Enzyme Inhibition Constant Data from BindingDB
Found 1 hit for monomerid = 50289028
TargetAcyl-CoA:cholesterol acyltransferase(Oryctolagus cuniculus)
TBA
Curated by ChEMBL
LigandPNGBDBM50289028(CHEMBL163615 | N-(2,6-Diisopropyl-phenyl)-malonami...)
Affinity DataIC50:  15nM. Assay description: In vitro inhibitory activity against Acyl coenzyme A:cholesterol acyltransferase in intestinal microsomes isolated from cholesterol fed rabbits (IAI)...
In DepthDetails Article