BDBM50289258 (S)-2-((S)-3-Carbamoyl-2-{(S)-2-[((R)-2-ethoxycarbonylamino-3-naphthalen-1-yl-propionyl)-methyl-amino]-5-guanidino-pentanoylamino}-propionylamino)-3-methyl-butyric acid methyl ester::CHEMBL80447
SMILES CCOC(=O)N[C@H](Cc1cccc2ccccc12)C(=O)N(C)[C@@H](CCCNC(N)=N)C(=O)N[C@@H](CC(N)=O)C(=O)N[C@@H](C(C)C)C(=O)OC
InChI Key InChIKey=WEAHFODXINKIKT-SFIUMABJSA-N
Data  2 IC50
  Tab Delimited (TSV)   2D SDfile   Computed 3D by Vconf -m prep SDfile
Find this compound or compounds like it in BindingDB:
Activity Spreadsheet -- Enzyme Inhibition Constant Data from BindingDB
Found 2 hits for monomerid = 50289258
TargetMHC class II antigen(Homo sapiens (Human))
TBA
Curated by ChEMBL
LigandPNGBDBM50289258((S)-2-((S)-3-Carbamoyl-2-{(S)-2-[((R)-2-ethoxycarb...)
Affinity DataIC50:  16nM. Assay description: Inhibitory concentration required to inhibit the binding of biotinylated rat myelin basic protein peptide (RMBP90-102) against DR1 allele of class II...
In DepthDetails Article
TargetMHC class II antigen(Homo sapiens (Human))
TBA
Curated by ChEMBL
LigandPNGBDBM50289258((S)-2-((S)-3-Carbamoyl-2-{(S)-2-[((R)-2-ethoxycarb...)
Affinity DataIC50:  16nM. Assay description: Inhibitory concentration to inhibit the binding of biotinylated rat myelin basic protein peptide (RMBP90-102) against DR1 allele of class II MHC for ...
In DepthDetails Article