BDBM50289275 ((S)-1-{(S)-1-[(S)-1-((S)-1-Carbamoyl-3-methyl-butylcarbamoyl)-ethylcarbamoyl]-2-methyl-propylcarbamoyl}-2-phenyl-ethyl)-carbamic acid ethyl ester::CHEMBL78426
SMILES CCOC(=O)N[C@@H](Cc1ccccc1)C(=O)N[C@@H](C(C)C)C(=O)N[C@@H](C)C(=O)N[C@@H](CC(C)C)C(N)=O
InChI Key InChIKey=VHXWPKUXXIKXSS-VMXMFDLUSA-N
Data  2 IC50
  Tab Delimited (TSV)   2D SDfile   Computed 3D by Vconf -m prep SDfile
Find this compound or compounds like it in BindingDB:
Activity Spreadsheet -- Enzyme Inhibition Constant Data from BindingDB
Found 2 hits for monomerid = 50289275
TargetMHC class II antigen(Homo sapiens (Human))
TBA
Curated by ChEMBL
LigandPNGBDBM50289275(((S)-1-{(S)-1-[(S)-1-((S)-1-Carbamoyl-3-methyl-but...)
Affinity DataIC50:  420nM. Assay description: Inhibitory concentration required to inhibit the binding of biotinylated rat myelin basic protein peptide (RMBP90-102) against DR1 allele of class II...
In DepthDetails Article
TargetMHC class II antigen(Homo sapiens (Human))
TBA
Curated by ChEMBL
LigandPNGBDBM50289275(((S)-1-{(S)-1-[(S)-1-((S)-1-Carbamoyl-3-methyl-but...)
Affinity DataIC50:  28nM. Assay description: Inhibitory concentration to inhibit the binding of biotinylated rat myelin basic protein peptide (RMBP90-102) against DR1 allele of class II MHC for ...
In DepthDetails Article