BDBM50289598 3-Fluoro-biphenyl-4-carboxylic acid [(R)-4-guanidino-1-((2S,6R)-2,9,9-trimethyl-3,5-dioxa-4-bora-tricyclo[6.1.1.0*2,6*]dec-4-yl)-butyl]-amide::CHEMBL290836
SMILES CC1(C)C2CC1[C@]1(C)OB(O[C@@H]1C2)[C@H](CCCNC(N)=N)NC(=O)c1ccc(cc1F)-c1ccccc1
InChI Key InChIKey=MNWDAWJIDFIUJH-FIBRCKFESA-N
Data  1 KI
  Tab Delimited (TSV)   2D SDfile   Computed 3D by Vconf -m prep SDfile
Find this compound or compounds like it in BindingDB:
Activity Spreadsheet -- Enzyme Inhibition Constant Data from BindingDB
Found 1 hit for monomerid = 50289598
TargetProthrombin(Homo sapiens (Human))
TBA
Curated by ChEMBL
LigandPNGBDBM50289598(3-Fluoro-biphenyl-4-carboxylic acid [(R)-4-guanidi...)
Affinity DataKi:  1.20nM. Assay description: Inhibition of thrombin
In DepthDetails Article