BDBM50289650 CHEMBL414047::Compound RES-701-1(1-10)/[A15]ET-3
SMILES CC[C@H](C)[C@H](NC(=O)[C@H](CC(O)=O)NC(=O)[C@H](CC(C)C)NC(=O)[C@H](Cc1cnc[nH]1)NC(=O)[C@H](C)NC(=O)[C@H](Cc1ccc(O)cc1)NC(=O)[C@H](Cc1ccc(O)cc1)NC(=O)[C@@H](NC(=O)[C@H](Cc1c[nH]c2ccccc12)NC(=O)[C@H]1CC(=O)NCC(=O)N[C@H](CC(N)=O)C(=O)N[C@@H](Cc2c[nH]c3ccccc23)C(=O)N[C@H](Cc2cnc[nH]2)C(=O)NCC(=O)N[C@H]([C@@H](C)O)C(=O)N[C@@H](C)C(=O)N2CCC[C@@H]2C(=O)N1)C(C)C)C(=O)N[C@@H]([C@@H](C)CC)C(=O)N[C@@H](Cc1c[nH]c2ccccc12)C(O)=O
InChI Key InChIKey=RTHOETHGYZVSOV-ADRWOKQDSA-N
Data  2 IC50
  Tab Delimited (TSV)   2D SDfile   Computed 3D by Vconf -m prep SDfile
Find this compound or compounds like it in BindingDB:
Activity Spreadsheet -- Enzyme Inhibition Constant Data from BindingDB
Found 2 hits for monomerid = 50289650
TargetEndothelin receptor type B(Bos taurus)
TBA
Curated by ChEMBL
LigandPNGBDBM50289650(CHEMBL414047 | Compound RES-701-1(1-10)/[A15]ET-3)
Affinity DataIC50:  2.5nM. Assay description: Binding activity to ET-B receptor on bovine cerebellum membrane
In DepthDetails Article
TargetEndothelin-1 receptor(Bos taurus)
TBA
Curated by ChEMBL
LigandPNGBDBM50289650(CHEMBL414047 | Compound RES-701-1(1-10)/[A15]ET-3)
Affinity DataIC50: >100nM. Assay description: Binding activity to ET-A receptor on bovine lung membrane was determined
In DepthDetails Article