BDBM50290213 CHEMBL80875::Thiophene-2-carboxylic acid {4-[2-(4-m-tolyl-piperazin-1-yl)-ethyl]-cyclohexyl}-amide
SMILES Cc1cccc(c1)N1CCN(CC[C@H]2CC[C@@H](CC2)NC(=O)c2cccs2)CC1
InChI Key InChIKey=RSAQDZVYAIXCFK-MEMLXQNLSA-N
Data  2 KI
  Tab Delimited (TSV)   2D SDfile   Computed 3D by Vconf -m prep SDfile
Find this compound or compounds like it in BindingDB:
Activity Spreadsheet -- Enzyme Inhibition Constant Data from BindingDB
Found 2 hits for monomerid = 50290213
TargetD(3) dopamine receptor(Homo sapiens (Human))
TBA
Curated by ChEMBL
LigandPNGBDBM50290213(CHEMBL80875 | Thiophene-2-carboxylic acid {4-[2-(4...)
Affinity DataKi:  2.40nM. Assay description: Ability to displace radioligand [3H]spiperone from human dopamine D3 receptor transfected chinese hamster ovary cell membranes.
In DepthDetails Article
TargetD(2) dopamine receptor(Homo sapiens (Human))
TBA
Curated by ChEMBL
LigandPNGBDBM50290213(CHEMBL80875 | Thiophene-2-carboxylic acid {4-[2-(4...)
Affinity DataKi:  6.30nM. Assay description: Ability to displace radioligand [3H]N-0437 from human dopamine D2 receptor transfected chinese hamster ovary cell membranes.
In DepthDetails Article