BDBM50290837 4-(3,4-Dimethoxy-phenoxy)-6,7-dimethoxy-quinazoline::CHEMBL431818
SMILES COc1ccc(Oc2ncnc3cc(OC)c(OC)cc23)cc1OC
InChI Key InChIKey=GITRKILOUAEMSZ-UHFFFAOYSA-N
Data  2 IC50
  Tab Delimited (TSV)   2D SDfile   Computed 3D by Vconf -m prep SDfile
Find this compound or compounds like it in BindingDB:
Activity Spreadsheet -- Enzyme Inhibition Constant Data from BindingDB
Found 2 hits for monomerid = 50290837
TargetEpidermal growth factor receptor(Homo sapiens (Human))
TBA
Curated by ChEMBL
LigandPNGBDBM50290837(4-(3,4-Dimethoxy-phenoxy)-6,7-dimethoxy-quinazolin...)
Affinity DataIC50: >1.00E+5nM. Assay description: Inhibition of epidermal growth factor receptor (EGF-R) autophosphorylation in A431 cells
In DepthDetails Article
TargetPlatelet-derived growth factor receptor beta(Rattus norvegicus)
TBA
Curated by ChEMBL
LigandPNGBDBM50290837(4-(3,4-Dimethoxy-phenoxy)-6,7-dimethoxy-quinazolin...)
Affinity DataIC50:  570nM. Assay description: Inhibition of PDGF-BB induced PDGF-B receptor autophosphorylation in rat mesangial cells.
In DepthDetails Article