BDBM50290844 6,7-Dimethoxy-4-(3-nitro-phenoxy)-quinoline::CHEMBL99272
SMILES COc1cc2nccc(Oc3cccc(c3)[N+]([O-])=O)c2cc1OC
InChI Key InChIKey=OMYGYNKHKZLDSH-UHFFFAOYSA-N
Data  1 IC50
  Tab Delimited (TSV)   2D SDfile   Computed 3D by Vconf -m prep SDfile
Find this compound or compounds like it in BindingDB:
Activity Spreadsheet -- Enzyme Inhibition Constant Data from BindingDB
Found 1 hit for monomerid = 50290844
TargetPlatelet-derived growth factor receptor beta(Rattus norvegicus)
TBA
Curated by ChEMBL
LigandPNGBDBM50290844(6,7-Dimethoxy-4-(3-nitro-phenoxy)-quinoline | CHEM...)
Affinity DataIC50:  700nM. Assay description: Inhibition of PDGF-BB induced PDGF-B receptor autophosphorylation in rat mesangial cells.
In DepthDetails Article