BDBM50291028 (2R,3R,4R,5S)-1-(Dimethyl-propyl-silanylmethyl)-2-hydroxymethyl-piperidine-3,4,5-triol::CHEMBL330763
SMILES CCC[Si](C)(C)CN1C[C@H](O)[C@@H](O)[C@H](O)[C@H]1CO
InChI Key InChIKey=DGURCLGKWHXDBI-WRWGMCAJSA-N
Data  3 KI
  Tab Delimited (TSV)   2D SDfile   Computed 3D by Vconf -m prep SDfile
Find this compound or compounds like it in BindingDB:
Activity Spreadsheet -- Enzyme Inhibition Constant Data from BindingDB
Found 3 hits for monomerid = 50291028
TargetSucrase-isomaltase, intestinal(Rattus norvegicus (Rat))
TBA
Curated by ChEMBL
LigandPNGBDBM50291028((2R,3R,4R,5S)-1-(Dimethyl-propyl-silanylmethyl)-2-...)
Affinity DataKi:  110nM. Assay description: Tested in vitro for the inhibition constant against rat small intestinal sucrase
In DepthDetails Article
TargetMaltase-glucoamylase(Homo sapiens (Human))
TBA
Curated by ChEMBL
LigandPNGBDBM50291028((2R,3R,4R,5S)-1-(Dimethyl-propyl-silanylmethyl)-2-...)
Affinity DataKi:  900nM. Assay description: In vitro inhibition constant against rat small intestinal glucoamylase
In DepthDetails Article
TargetSucrase-isomaltase, intestinal(Rattus norvegicus (Rat))
TBA
Curated by ChEMBL
LigandPNGBDBM50291028((2R,3R,4R,5S)-1-(Dimethyl-propyl-silanylmethyl)-2-...)
Affinity DataKi:  7.00E+3nM. Assay description: Tested in vitro for the inhibition constant against rat small intestinal isomaltase
In DepthDetails Article