BDBM50291053 3-{Cyclopropyl-[3-(pyridine-2-sulfonylmethyl)-phenyl]-methyl}-4-hydroxy-5,6,7,8,9,10-hexahydro-cycloocta[b]pyran-2-one::CHEMBL129802
SMILES Oc1c2CCCCCCc2oc(=O)c1C(C1CC1)c1cccc(CS(=O)(=O)c2ccccn2)c1
InChI Key InChIKey=PJQYZOKBNIAZTD-UHFFFAOYSA-N
Data  1 KI
  Tab Delimited (TSV)   2D SDfile   Computed 3D by Vconf -m prep SDfile
Find this compound or compounds like it in BindingDB:
Activity Spreadsheet -- Enzyme Inhibition Constant Data from BindingDB
Found 1 hit for monomerid = 50291053
TargetGag-Pol polyprotein [489-587](Human immunodeficiency virus type 1)
TBA
Curated by ChEMBL
LigandPNGBDBM50291053(3-{Cyclopropyl-[3-(pyridine-2-sulfonylmethyl)-phen...)
Affinity DataKi:  1.90nM. Assay description: Inhibition of HIV-1 protease.
In DepthDetails Article