BDBM50291183 (S)-2-Acetylamino-N-[(R)-1-((R)-1-formyl-3-methyl-butylcarbamoyl)-2-phenyl-ethyl]-3-methyl-butyramide::CHEMBL150136
SMILES CC(C)C[C@@H](NC(=O)[C@@H](Cc1ccccc1)NC(=O)[C@@H](NC(C)=O)C(C)C)C=O
InChI Key InChIKey=AINHJKSUELDCPL-AQNXPRMDSA-N
Data  1 IC50
  Tab Delimited (TSV)   2D SDfile   Computed 3D by Vconf -m prep SDfile
Find this compound or compounds like it in BindingDB:
Activity Spreadsheet -- Enzyme Inhibition Constant Data from BindingDB
Found 1 hit for monomerid = 50291183
TargetCalpain-1 catalytic subunit(Homo sapiens (Human))
TBA
Curated by ChEMBL
LigandPNGBDBM50291183((S)-2-Acetylamino-N-[(R)-1-((R)-1-formyl-3-methyl-...)
Affinity DataIC50:  110nM. Assay description: Inhibitory activity evaluated against recombinant human calpain 1
In DepthDetails Article