BDBM50291846 4-Oxo-7-(quinolin-2-ylmethoxy)-4H-chromene-2-carboxylic acid::CHEMBL46362
SMILES OC(=O)c1cc(=O)c2ccc(OCc3ccc4ccccc4n3)cc2o1
InChI Key InChIKey=OEWOGUZQPCEFMV-UHFFFAOYSA-N
Data  1 KI
  Tab Delimited (TSV)   2D SDfile   Computed 3D by Vconf -m prep SDfile
Find this compound or compounds like it in BindingDB:
Activity Spreadsheet -- Enzyme Inhibition Constant Data from BindingDB
Found 1 hit for monomerid = 50291846
TargetCysteinyl leukotriene receptor 1(GUINEA PIG)
Rhone-Poulenc Rorer Central Research
Curated by ChEMBL
LigandPNGBDBM50291846(4-Oxo-7-(quinolin-2-ylmethoxy)-4H-chromene-2-carbo...)
Affinity DataKi:  7.00E+3nM. Assay description: Binding affinity against LTD4 receptor in guinea pig lung membranes.
In DepthDetails ArticlePubMed