BDBM50291855 7-[3-(Quinolin-2-ylmethoxy)-phenoxymethyl]-2-(1H-tetrazol-5-yl)-chroman-4-one::CHEMBL46663
SMILES O=C1CC(Oc2cc(COc3cccc(OCc4ccc5ccccc5n4)c3)ccc12)c1nnn[nH]1
InChI Key InChIKey=IAGCJPRHIHQXHK-UHFFFAOYSA-N
Data  1 KI
  Tab Delimited (TSV)   2D SDfile   Computed 3D by Vconf -m prep SDfile
Find this compound or compounds like it in BindingDB:
Activity Spreadsheet -- Enzyme Inhibition Constant Data from BindingDB
Found 1 hit for monomerid = 50291855
TargetCysteinyl leukotriene receptor 1(GUINEA PIG)
Rhone-Poulenc Rorer Central Research
Curated by ChEMBL
LigandPNGBDBM50291855(7-[3-(Quinolin-2-ylmethoxy)-phenoxymethyl]-2-(1H-t...)
Affinity DataKi:  0.120nM. Assay description: Binding affinity against LTD4 receptor in guinea pig lung membranes.
In DepthDetails ArticlePubMed