BDBM50293520 CHEMBL537968::N-(1H-indazol-5-yl)-2-(6-methylpyridin-2-yl)quinazolin-4-amine::N-1H-indazol-5-yl-2-(6-methylpyridin-2-yl)quinazolin-4-amine
SMILES Cc1cccc(n1)-c1nc(Nc2ccc3[nH]ncc3c2)c2ccccc2n1
InChI Key InChIKey=HNHRWNUXTCATSG-UHFFFAOYSA-N
Data  3 IC50
PDB links: 1 PDB ID matches this monomer.
  Tab Delimited (TSV)   2D SDfile   Computed 3D by Vconf -m prep SDfile
Find this compound or compounds like it in BindingDB:
Activity Spreadsheet -- Enzyme Inhibition Constant Data from BindingDB
Found 3 hits for monomerid = 50293520
TargetTGF-beta receptor type-1(Homo sapiens (Human))
Glaxosmithkline
Curated by ChEMBL
LigandPNGBDBM50293520(CHEMBL537968 | N-(1H-indazol-5-yl)-2-(6-methylpyri...)
Affinity DataIC50:  25nM. Assay description: Inhibition of human ALK5 kinase expressed in Sf9 cells
TargetTGF-beta receptor type-1(Homo sapiens (Human))
Glaxosmithkline
Curated by ChEMBL
LigandPNGBDBM50293520(CHEMBL537968 | N-(1H-indazol-5-yl)-2-(6-methylpyri...)
Affinity DataIC50: >1.00E+4nM. Assay description: Inhibition of GST-fused p38alpha
TargetTGF-beta receptor type-1(Homo sapiens (Human))
Glaxosmithkline
Curated by ChEMBL
LigandPNGBDBM50293520(CHEMBL537968 | N-(1H-indazol-5-yl)-2-(6-methylpyri...)
Affinity DataIC50:  90nM. Assay description: Inhibition of TGFbeta-induced ALK5 in human HepG2 cells by luciferase assay