BDBM50294189 CHEMBL4161485
SMILES CCC(CC)O[C@@H]1C=C(C[C@H](N)[C@H]1NC(C)=O)C(=O)NCCc1ccccc1F
InChI Key InChIKey=XEFZMAJUXPQLHQ-PWRODBHTSA-N
Data  2 IC50
  Tab Delimited (TSV)   2D SDfile   Computed 3D by Vconf -m prep SDfile
Find this compound or compounds like it in BindingDB:
Activity Spreadsheet -- Enzyme Inhibition Constant Data from BindingDB
Found 2 hits for monomerid = 50294189
TargetNeuraminidase(Influenza A virus)
Shandong University
Curated by ChEMBL
LigandPNGBDBM50294189(CHEMBL4161485)
Affinity DataIC50:  5.12E+3nM. Assay description: Inhibition of influenza A virus duck/Guangdong/674/2014(H5N6) neuraminidase using 4-MU-NANA as substrate pre-incubated for 10 mins followed by substr...
In DepthDetails ArticlePubMed
TargetNeuraminidase(Influenza A virus)
Shandong University
Curated by ChEMBL
LigandPNGBDBM50294189(CHEMBL4161485)
Affinity DataIC50:  3.17E+3nM. Assay description: Inhibition of influenza A virus chicken/china/1220/2012(H5N1) neuraminidase using 4-MU-NANA as substrate pre-incubated for 10 mins followed by substr...
In DepthDetails ArticlePubMed