BDBM50294418 4-{[(9S,15R,18S,21S)-15-carbamoyl-21-(carbamoylmethyl)-8,11,17,20,23-pentaoxo-18-(propan-2-yl)-13-thia-7,10,16,19,22-pentaazaspiro[5.17]tricosan-9-yl]methyl}phenoxyphosphonic acid::CHEMBL558991
SMILES CC(C)[C@@H]1NC(=O)[C@H](CC(N)=O)NC(=O)C2(CCCCC2)NC(=O)[C@H](Cc2ccc(OP(O)(O)=O)cc2)NC(=O)CSC[C@H](NC1=O)C(N)=O
InChI Key InChIKey=XNJGRGUYRZTSMC-CIEVZJJWSA-N
Data  1 Kd
  Tab Delimited (TSV)   2D SDfile   Computed 3D by Vconf -m prep SDfile
Find this compound or compounds like it in BindingDB:
Activity Spreadsheet -- Enzyme Inhibition Constant Data from BindingDB
Found 1 hit for monomerid = 50294418
TargetGrowth factor receptor-bound protein 2(Homo sapiens (Human))
Chinese Academy Of Sciences
Curated by ChEMBL
LigandPNGBDBM50294418(4-{[(9S,15R,18S,21S)-15-carbamoyl-21-(carbamoylmet...)
Affinity DataKd:  1.42E+3nM. Assay description: Binding affinity to GST-tagged recombinant Grb2 SH2 domain by Biacore assay
In DepthDetails ArticlePubMed