BDBM50294732 CHEMBL4171650
SMILES CCC(CC)O[C@@H]1C=C(C[C@H](N)[C@H]1NC(C)=O)C(=O)NC(C(C)C)C(O)=O
InChI Key InChIKey=XPVQAQNKOLGKPP-RUENRELNSA-N
Data  3 IC50
  Tab Delimited (TSV)   2D SDfile   Computed 3D by Vconf -m prep SDfile
Find this compound or compounds like it in BindingDB:
Activity Spreadsheet -- Enzyme Inhibition Constant Data from BindingDB
Found 3 hits for monomerid = 50294732
TargetNeuraminidase(Influenza A virus)
Shandong University
Curated by ChEMBL
LigandPNGBDBM50294732(CHEMBL4171650)
Affinity DataIC50:  135nM. Assay description: Inhibition of influenza A virus chicken/china/1220/2012(H5N1) neuraminidase using 4-MU-NANA as substrate pre-incubated for 10 mins followed by substr...
In DepthDetails ArticlePubMed
TargetNeuraminidase(Influenza A virus)
Shandong University
Curated by ChEMBL
LigandPNGBDBM50294732(CHEMBL4171650)
Affinity DataIC50:  7.09E+4nM. Assay description: Inhibition of influenza A virus chicken/china/1220/2012(H5N1) neuraminidase H274Y mutant using 4-MU-NANA as substrate pre-incubated for 10 mins follo...
In DepthDetails ArticlePubMed
TargetNeuraminidase(Influenza A virus)
Shandong University
Curated by ChEMBL
LigandPNGBDBM50294732(CHEMBL4171650)
Affinity DataIC50:  248nM. Assay description: Inhibition of influenza A virus duck/Guangdong/674/2014(H5N6) neuraminidase using 4-MU-NANA as substrate pre-incubated for 10 mins followed by substr...
In DepthDetails ArticlePubMed