BDBM50295160 CHEMBL4163284
SMILES CCC(CC)O[C@@H]1C=C(C[C@H](N)[C@H]1NC(C)=O)C(=O)N[C@@H](C)C(O)=O
InChI Key InChIKey=QUTHGGAQPYAKKU-ISGRIPCHSA-N
Data  2 IC50
  Tab Delimited (TSV)   2D SDfile   Computed 3D by Vconf -m prep SDfile
Find this compound or compounds like it in BindingDB:
Activity Spreadsheet -- Enzyme Inhibition Constant Data from BindingDB
Found 2 hits for monomerid = 50295160
TargetNeuraminidase(Influenza A virus)
Shandong University
Curated by ChEMBL
LigandPNGBDBM50295160(CHEMBL4163284)
Affinity DataIC50:  1.28E+3nM. Assay description: Inhibition of influenza A virus duck/Guangdong/674/2014(H5N6) neuraminidase using 4-MU-NANA as substrate pre-incubated for 10 mins followed by substr...
In DepthDetails ArticlePubMed
TargetNeuraminidase(Influenza A virus)
Shandong University
Curated by ChEMBL
LigandPNGBDBM50295160(CHEMBL4163284)
Affinity DataIC50:  2.20E+3nM. Assay description: Inhibition of influenza A virus chicken/china/1220/2012(H5N1) neuraminidase using 4-MU-NANA as substrate pre-incubated for 10 mins followed by substr...
In DepthDetails ArticlePubMed