BDBM50295290 (+/-)-trans-3-(2-((diethylamino)methyl)cyclopentyl)-1H-indole-5-carbonitrile::CHEMBL562625
SMILES CCN(CC)C[C@H]1CCC[C@@H]1c1c[nH]c2ccc(cc12)C#N
InChI Key InChIKey=AVCUNTXPYNDWEE-CVEARBPZSA-N
Data  1 IC50
  Tab Delimited (TSV)   2D SDfile   Computed 3D by Vconf -m prep SDfile
Find this compound or compounds like it in BindingDB:
Activity Spreadsheet -- Enzyme Inhibition Constant Data from BindingDB
Found 1 hit for monomerid = 50295290
TargetSodium-dependent serotonin transporter(Homo sapiens (Human))
Bristol-Myers Squibb Pharmaceutical Research Institute
Curated by ChEMBL
LigandPNGBDBM50295290((+/-)-trans-3-(2-((diethylamino)methyl)cyclopentyl...)
Affinity DataIC50:  240nM. Assay description: Displacement of [125I]RTI-55 from human SERT expressed in HEK293 cells
In DepthDetails ArticlePubMed