BDBM50295292 (+/-)-trans-3-(2-((benzyl(methyl)amino)methyl)cyclopentyl)-1H-indole-5-carbonitrile::CHEMBL557914
SMILES CN(C[C@H]1CCC[C@@H]1c1c[nH]c2ccc(cc12)C#N)Cc1ccccc1
InChI Key InChIKey=FAHCYHHUZOVIAW-UXHICEINSA-N
Data  1 IC50
  Tab Delimited (TSV)   2D SDfile   Computed 3D by Vconf -m prep SDfile
Find this compound or compounds like it in BindingDB:
Activity Spreadsheet -- Enzyme Inhibition Constant Data from BindingDB
Found 1 hit for monomerid = 50295292
TargetSodium-dependent serotonin transporter(Homo sapiens (Human))
Bristol-Myers Squibb Pharmaceutical Research Institute
Curated by ChEMBL
LigandPNGBDBM50295292((+/-)-trans-3-(2-((benzyl(methyl)amino)methyl)cycl...)
Affinity DataIC50:  85nM. Assay description: Displacement of [125I]RTI-55 from human SERT expressed in HEK293 cells
In DepthDetails ArticlePubMed