BDBM50295425 3-[3-(N-Benzyl-N-methylamino)propyl]benzo[d]oxazol-2(3H)-one::CHEMBL564522
SMILES CN(CCCn1c2ccccc2oc1=O)Cc1ccccc1
InChI Key InChIKey=ICVRRBZWGSYGJA-UHFFFAOYSA-N
Data  3 KI
  Tab Delimited (TSV)   2D SDfile   Computed 3D by Vconf -m prep SDfile
Find this compound or compounds like it in BindingDB:
Activity Spreadsheet -- Enzyme Inhibition Constant Data from BindingDB
Found 3 hits for monomerid = 50295425
TargetSigma non-opioid intracellular receptor 1(Homo sapiens (Human))
University Of Lille
Curated by ChEMBL
LigandPNGBDBM50295425(3-[3-(N-Benzyl-N-methylamino)propyl]benzo[d]oxazol...)
Affinity DataKi: >100nM. Assay description: Displacement of [3H](+)Pentazocine from sigma 1 receptor in human Jurkat cells after 120 mins by liquid scintillation counting analysis
In DepthDetails ArticlePubMed
LigandPNGBDBM50295425(3-[3-(N-Benzyl-N-methylamino)propyl]benzo[d]oxazol...)
Affinity DataKi:  223nM. Assay description: Displacement of [3H]-pentazocine from sigma 1 opioid receptor in rat liver homogenate by liquid scintillation counting
In DepthDetails ArticlePubMed
LigandPNGBDBM50295425(3-[3-(N-Benzyl-N-methylamino)propyl]benzo[d]oxazol...)
Affinity DataKi:  223nM. Assay description: Displacement of [3H](+)-pentazocine from sigma1 receptor in rat liver membrane by liquid scintillation counting
In DepthDetails ArticlePubMed