BDBM50295694 2-(3,4-difluorophenyl)-N-ethyl-N-(3-(6-fluoro-3H-spiro[isobenzofuran-1,4'-piperidine]-1'-yl)propyl)-2-(2-oxopiperazin-1-yl)acetamide::CHEMBL558305
SMILES CCN(CCCN1CCC2(CC1)OCc1ccc(F)cc21)C(=O)C(N1CCNCC1=O)c1ccc(F)c(F)c1
InChI Key InChIKey=JGOSZIHAFPICES-UHFFFAOYSA-N
Data  1 IC50
  Tab Delimited (TSV)   2D SDfile   Computed 3D by Vconf -m prep SDfile
Find this compound or compounds like it in BindingDB:
Activity Spreadsheet -- Enzyme Inhibition Constant Data from BindingDB
Found 1 hit for monomerid = 50295694
TargetMelanin-concentrating hormone receptor 1(Homo sapiens (Human))
Tsukuba Research Institute
Curated by ChEMBL
LigandPNGBDBM50295694(2-(3,4-difluorophenyl)-N-ethyl-N-(3-(6-fluoro-3H-s...)
Affinity DataIC50:  0.870nM. Assay description: Displacement of[125I]MCH from human MCH1R expressed in CHO cells
In DepthDetails ArticlePubMed