BDBM50296140 CHEMBL560183::N-(((S)-1-((R)-3-amino-4-(2-fluorophenyl)butanoyl)pyrrolidin-2-yl)methyl)-2,5-dichlorobenzenesulfonamide
SMILES N[C@@H](CC(=O)N1CCC[C@H]1CNS(=O)(=O)c1cc(Cl)ccc1Cl)Cc1ccccc1F
InChI Key InChIKey=GUKXSTARZIHVLU-SJORKVTESA-N
Data  1 IC50
  Tab Delimited (TSV)   2D SDfile   Computed 3D by Vconf -m prep SDfile
Find this compound or compounds like it in BindingDB:
Activity Spreadsheet -- Enzyme Inhibition Constant Data from BindingDB
Found 1 hit for monomerid = 50296140
TargetDipeptidyl peptidase 4(Homo sapiens (Human))
Santhera Pharmaceuticals (Switzerland)
Curated by ChEMBL
LigandPNGBDBM50296140(CHEMBL560183 | N-(((S)-1-((R)-3-amino-4-(2-fluorop...)
Affinity DataIC50:  24nM. Assay description: Inhibition of DPP4 by continuous fluorimetric assay
In DepthDetails ArticlePubMed