BDBM50296327 (3R)-1-Heptyl-3-{[hydroxy(di-2-thienyl)acetyl]oxy}-1-azoniabicyclo[2.2.2]octane bromide::CHEMBL549784
SMILES [Br-].CCCCCCC[N+]12CCC(CC1)[C@H](C2)OC(=O)C(O)(c1cccs1)c1cccs1
InChI Key InChIKey=OEKSMYDGWZJQDC-VQRHYKMASA-M
Data  3 IC50
  Tab Delimited (TSV)   2D SDfile   Computed 3D by Vconf -m prep SDfile
Find this compound or compounds like it in BindingDB:
Activity Spreadsheet -- Enzyme Inhibition Constant Data from BindingDB
Found 3 hits for monomerid = 50296327
TargetMuscarinic acetylcholine receptor M1(Homo sapiens (Human))
RhôNe-Poulenc Rorer
Curated by ChEMBL
LigandPNGBDBM50296327((3R)-1-Heptyl-3-{[hydroxy(di-2-thienyl)acetyl]oxy}...)
Affinity DataIC50:  0.410nM. Assay description: Displacement of [3H]NMS from human muscarinic M1 receptor expressed in CHOK1 cells by microplate scintillation counting
In DepthDetails ArticlePubMed
TargetMuscarinic acetylcholine receptor M3(Homo sapiens (Human))
RhôNe-Poulenc Rorer
Curated by ChEMBL
LigandPNGBDBM50296327((3R)-1-Heptyl-3-{[hydroxy(di-2-thienyl)acetyl]oxy}...)
Affinity DataIC50:  0.390nM. Assay description: Displacement of [3H]NMS from human muscarinic M3 receptor expressed in CHOK1 cells by microplate scintillation counting
In DepthDetails ArticlePubMed
TargetMuscarinic acetylcholine receptor M2(Homo sapiens (Human))
RhôNe-Poulenc Rorer
Curated by ChEMBL
LigandPNGBDBM50296327((3R)-1-Heptyl-3-{[hydroxy(di-2-thienyl)acetyl]oxy}...)
Affinity DataIC50:  0.360nM. Assay description: Displacement of [3H]NMS from human muscarinic M2 receptor expressed in CHOK1 cells by microplate scintillation counting
In DepthDetails ArticlePubMed