BDBM50296337 (3R)-3-{[(2R)-2-Cyclopentyl-2-hydroxy-2-(2-thienyl)acetyl]-oxy}-1-(3-phenoxypropyl)-1-azoniabicyclo[2.2.2]octane bromide::CHEMBL549986
SMILES O[C@](C1CCCC1)(C(=O)O[C@H]1C[N+]2(CCCOc3ccccc3)CCC1CC2)c1cccs1
InChI Key InChIKey=MTYMLJSBEPCLGC-SETCOJICSA-N
Data  3 IC50
  Tab Delimited (TSV)   2D SDfile   Computed 3D by Vconf -m prep SDfile
Find this compound or compounds like it in BindingDB:
Activity Spreadsheet -- Enzyme Inhibition Constant Data from BindingDB
Found 3 hits for monomerid = 50296337
TargetMuscarinic acetylcholine receptor M1(Homo sapiens (Human))
RhôNe-Poulenc Rorer
Curated by ChEMBL
LigandPNGBDBM50296337((3R)-3-{[(2R)-2-Cyclopentyl-2-hydroxy-2-(2-thienyl...)
Affinity DataIC50:  0.810nM. Assay description: Displacement of [3H]NMS from human muscarinic M1 receptor expressed in CHOK1 cells by microplate scintillation counting
In DepthDetails ArticlePubMed
TargetMuscarinic acetylcholine receptor M3(Homo sapiens (Human))
RhôNe-Poulenc Rorer
Curated by ChEMBL
LigandPNGBDBM50296337((3R)-3-{[(2R)-2-Cyclopentyl-2-hydroxy-2-(2-thienyl...)
Affinity DataIC50:  1.62nM. Assay description: Displacement of [3H]NMS from human muscarinic M3 receptor expressed in CHOK1 cells by microplate scintillation counting
In DepthDetails ArticlePubMed
TargetMuscarinic acetylcholine receptor M2(Homo sapiens (Human))
RhôNe-Poulenc Rorer
Curated by ChEMBL
LigandPNGBDBM50296337((3R)-3-{[(2R)-2-Cyclopentyl-2-hydroxy-2-(2-thienyl...)
Affinity DataIC50:  1.01nM. Assay description: Displacement of [3H]NMS from human muscarinic M2 receptor expressed in CHOK1 cells by microplate scintillation counting
In DepthDetails ArticlePubMed