BDBM50297250 3-{[(5,6-Dihydroxy-4-oxo-4H-chromen-2-ylmethyl)-amino]-methyl}-benzonitrile::CHEMBL560392
SMILES Oc1cc(CNCc2cccc(c2)C#N)oc2ccc(O)c(=O)c12
InChI Key InChIKey=SPQVVHKCYIGRHU-UHFFFAOYSA-N
Data  2 IC50
  Tab Delimited (TSV)   2D SDfile   Computed 3D by Vconf -m prep SDfile
Find this compound or compounds like it in BindingDB:
Activity Spreadsheet -- Enzyme Inhibition Constant Data from BindingDB
Found 2 hits for monomerid = 50297250
TargetReplicase polyprotein 1ab(Human SARS coronavirus (SARS-CoV) (Severe acute re...)
Konkuk University
Curated by ChEMBL
LigandPNGBDBM50297250(3-{[(5,6-Dihydroxy-4-oxo-4H-chromen-2-ylmethyl)-am...)
Affinity DataIC50: >5.00E+4nM. Assay description: Inhibition of SARS coronavirus helicase assessed as duplex-DNA unwinding by FRET based assay
In DepthDetails ArticlePubMed
TargetReplicase polyprotein 1ab(Human SARS coronavirus (SARS-CoV) (Severe acute re...)
Konkuk University
Curated by ChEMBL
LigandPNGBDBM50297250(3-{[(5,6-Dihydroxy-4-oxo-4H-chromen-2-ylmethyl)-am...)
Affinity DataIC50: >5.00E+4nM. Assay description: Inhibition of ATPase activity of SARS coronavirus helicase assessed as phosphate release by malachite green assay
In DepthDetails ArticlePubMed