BDBM50297478 5-fluoro-3-(hydroxyimino)-1-(4-methoxybenzyl)indolin-2-one::CHEMBL564745
SMILES COc1ccc(CN2C(=O)C(N=O)c3cc(F)ccc23)cc1
InChI Key InChIKey=NRGHJPXGJNCGQR-UHFFFAOYSA-N
Data  1 KI
  Tab Delimited (TSV)   2D SDfile   Computed 3D by Vconf -m prep SDfile
Find this compound or compounds like it in BindingDB:
Activity Spreadsheet -- Enzyme Inhibition Constant Data from BindingDB
Found 1 hit for monomerid = 50297478
TargetMitogen-activated protein kinase 10(Homo sapiens (Human))
Vertex Pharmaceuticals
Curated by ChEMBL
LigandPNGBDBM50297478(5-fluoro-3-(hydroxyimino)-1-(4-methoxybenzyl)indol...)
Affinity DataKi:  1.60E+3nM. Assay description: Inhibition of JNK3 by spectrophotometric coupled enzyme assay
In DepthDetails ArticlePubMed