BDBM50297490 3-(hydroxyimino)-1-(4-nitrobenzyl)indolin-2-one::CHEMBL559949
SMILES [O-][N+](=O)c1ccc(CN2C(=O)C(N=O)c3ccccc23)cc1
InChI Key InChIKey=FJNWINYBGRYDPD-UHFFFAOYSA-N
Data  1 KI
  Tab Delimited (TSV)   2D SDfile   Computed 3D by Vconf -m prep SDfile
Find this compound or compounds like it in BindingDB:
Activity Spreadsheet -- Enzyme Inhibition Constant Data from BindingDB
Found 1 hit for monomerid = 50297490
TargetMitogen-activated protein kinase 10(Homo sapiens (Human))
Vertex Pharmaceuticals
Curated by ChEMBL
LigandPNGBDBM50297490(3-(hydroxyimino)-1-(4-nitrobenzyl)indolin-2-one | ...)
Affinity DataKi:  7.00E+3nM. Assay description: Inhibition of JNK3 by spectrophotometric coupled enzyme assay
In DepthDetails ArticlePubMed