BDBM50298309 CHEMBL574533::ETP-7146::N-(3-methoxyphenyl)-1-methyl-6-(4-methylpiperazin-1-yl)-1H-pyrazolo[3,4-d]pyrimidin-4-amine
SMILES COc1cccc(Nc2nc(nc3n(C)ncc23)N2CCN(C)CC2)c1
InChI Key InChIKey=OCGQAKYJZXVEPH-UHFFFAOYSA-N
Data  2 IC50
  Tab Delimited (TSV)   2D SDfile   Computed 3D by Vconf -m prep SDfile
Find this compound or compounds like it in BindingDB:
Activity Spreadsheet -- Enzyme Inhibition Constant Data from BindingDB
Found 2 hits for monomerid = 50298309
Target5-hydroxytryptamine receptor 2C(Homo sapiens (Human))
Institute Of Science And Technology
Curated by ChEMBL
LigandPNGBDBM50298309(CHEMBL574533 | ETP-7146 | N-(3-methoxyphenyl)-1-me...)
Affinity DataIC50:  7.80nM. Assay description: Displacement of [3H]Mesulergine from human recombinant serotonin 5-HT2C expressed in CHO-K1 cells
In DepthDetails ArticlePubMed
TargetPhosphatidylinositol 4,5-bisphosphate 3-kinase catalytic subunit alpha isoform(Homo sapiens (Human))
Spanish National Cancer Research Center (Cnio)
LigandPNGBDBM50298309(CHEMBL574533 | ETP-7146 | N-(3-methoxyphenyl)-1-me...)
Affinity DataIC50:  9.20E+3nM. Assay description: Kinase assay using PI3K.
In DepthDetails ArticlePubMed