BDBM50298434 5-(5-((S)-2-amino-3-(1H-indol-3-yl)propoxy)pyridin-3-yl)-3-cyclopropylindolin-2-one::CHEMBL574269
SMILES N[C@H](COc1cncc(c1)-c1ccc2NC(=O)C(C3CC3)c2c1)Cc1c[nH]c2ccccc12
InChI Key InChIKey=JHQZSPAWMMVUEC-DQUNLGLBSA-N
Data  1 IC50
  Tab Delimited (TSV)   2D SDfile   Computed 3D by Vconf -m prep SDfile
Find this compound or compounds like it in BindingDB:
Activity Spreadsheet -- Enzyme Inhibition Constant Data from BindingDB
Found 1 hit for monomerid = 50298434
TargetRAC-alpha serine/threonine-protein kinase(Homo sapiens (Human))
Zhejiang University
Curated by ChEMBL
LigandPNGBDBM50298434(5-(5-((S)-2-amino-3-(1H-indol-3-yl)propoxy)pyridin...)
Affinity DataIC50:  3.30nM. Assay description: Inhibition of Akt
In DepthDetails ArticlePubMed