BDBM50298439 5-(5-((S)-2-amino-3-(1H-indol-3-yl)propoxy)pyridin-3-yl)-3-(1-methyl-1H-pyrrol-2-yl)indolin-2-one::CHEMBL583705
SMILES Cn1cccc1C1C(=O)Nc2ccc(cc12)-c1cncc(OC[C@@H](N)Cc2c[nH]c3ccccc23)c1
InChI Key InChIKey=XDOMCHMIZLQRBD-QDLLFRBVSA-N
Data  1 IC50
  Tab Delimited (TSV)   2D SDfile   Computed 3D by Vconf -m prep SDfile
Find this compound or compounds like it in BindingDB:
Activity Spreadsheet -- Enzyme Inhibition Constant Data from BindingDB
Found 1 hit for monomerid = 50298439
TargetRAC-alpha serine/threonine-protein kinase(Homo sapiens (Human))
Zhejiang University
Curated by ChEMBL
LigandPNGBDBM50298439(5-(5-((S)-2-amino-3-(1H-indol-3-yl)propoxy)pyridin...)
Affinity DataIC50:  8.20nM. Assay description: Inhibition of Akt
In DepthDetails ArticlePubMed