BDBM50298440 5-(5-((S)-2-amino-3-(1H-indol-3-yl)propoxy)pyridin-3-yl)-3,3'-biindolin-2-one::CHEMBL573096
SMILES N[C@H](COc1cncc(c1)-c1ccc2NC(=O)C(c3c[nH]c4ccccc34)c2c1)Cc1c[nH]c2ccccc12
InChI Key InChIKey=GUYJHASVHZWTMS-DEUJGTPJSA-N
Data  1 IC50
  Tab Delimited (TSV)   2D SDfile   Computed 3D by Vconf -m prep SDfile
Find this compound or compounds like it in BindingDB:
Activity Spreadsheet -- Enzyme Inhibition Constant Data from BindingDB
Found 1 hit for monomerid = 50298440
TargetRAC-alpha serine/threonine-protein kinase(Homo sapiens (Human))
Zhejiang University
Curated by ChEMBL
LigandPNGBDBM50298440(5-(5-((S)-2-amino-3-(1H-indol-3-yl)propoxy)pyridin...)
Affinity DataIC50:  153nM. Assay description: Inhibition of Akt
In DepthDetails ArticlePubMed