BDBM50298444 5-(5-((S)-2-amino-3-(1H-indol-3-yl)propoxy)pyridin-3-yl)-3-(thiophen-2-yl)indolin-2-one::CHEMBL572884
SMILES N[C@H](COc1cncc(c1)-c1ccc2NC(=O)C(c3cccs3)c2c1)Cc1c[nH]c2ccccc12
InChI Key InChIKey=VHKOLGNBWBIWAS-SVQMELKDSA-N
Data  1 IC50
  Tab Delimited (TSV)   2D SDfile   Computed 3D by Vconf -m prep SDfile
Find this compound or compounds like it in BindingDB:
Activity Spreadsheet -- Enzyme Inhibition Constant Data from BindingDB
Found 1 hit for monomerid = 50298444
TargetRAC-alpha serine/threonine-protein kinase(Homo sapiens (Human))
Zhejiang University
Curated by ChEMBL
LigandPNGBDBM50298444(5-(5-((S)-2-amino-3-(1H-indol-3-yl)propoxy)pyridin...)
Affinity DataIC50:  0.900nM. Assay description: Inhibition of Akt
In DepthDetails ArticlePubMed