BDBM50298460 (S)-1-(1H-indol-3-yl)-3-(5-(3-phenyl-1H-indazol-5-yl)pyridin-3-yloxy)propan-2-amine::CHEMBL574764
SMILES N[C@H](COc1cncc(c1)-c1ccc2[nH]nc(-c3ccccc3)c2c1)Cc1c[nH]c2ccccc12
InChI Key InChIKey=YFSJPNKAWKKQSL-QHCPKHFHSA-N
Data  1 IC50
  Tab Delimited (TSV)   2D SDfile   Computed 3D by Vconf -m prep SDfile
Find this compound or compounds like it in BindingDB:
Activity Spreadsheet -- Enzyme Inhibition Constant Data from BindingDB
Found 1 hit for monomerid = 50298460
TargetRAC-alpha serine/threonine-protein kinase(Homo sapiens (Human))
Zhejiang University
Curated by ChEMBL
LigandPNGBDBM50298460((S)-1-(1H-indol-3-yl)-3-(5-(3-phenyl-1H-indazol-5-...)
Affinity DataIC50:  3.90nM. Assay description: Inhibition of Akt
In DepthDetails ArticlePubMed