BDBM50298758 (5S,8S,11S,14S,17R)-11-(4-aminobutyl)-5,8-bis(hydroxymethyl)-14-isobutyl-4,7,10,19-tetramethyl-3,6,9,12,15-pentaoxo-1-phenyl-2-oxa-4,7,10,13,16-pentaazaicosan-17-ylboronic acid::CHEMBL574678
SMILES CC(C)C[C@H](NC(=O)[C@H](CC(C)C)NC(=O)[C@H](CCCCN)N(C)C(=O)[C@H](CO)N(C)C(=O)[C@H](CO)N(C)C(=O)OCc1ccccc1)B(O)O
InChI Key InChIKey=QGHYAXAPQBEMBQ-ZIUUJSQJSA-N
Data  1 KI
  Tab Delimited (TSV)   2D SDfile   Computed 3D by Vconf -m prep SDfile
Find this compound or compounds like it in BindingDB:
Activity Spreadsheet -- Enzyme Inhibition Constant Data from BindingDB
Found 1 hit for monomerid = 50298758
TargetProstate-specific antigen(Homo sapiens (Human))
The Johns Hopkins University School Of Medicine
Curated by ChEMBL
LigandPNGBDBM50298758((5S,8S,11S,14S,17R)-11-(4-aminobutyl)-5,8-bis(hydr...)
Affinity DataKi: >50nM. Assay description: Inhibition of prostate-specific antigen assessed as substrate hydrolysis by fluorescence assay
In DepthDetails ArticlePubMed