BDBM50299598 CHEMBL568484::N-(3-bromophenyl)-N'-cyano-4-(5-methyl-7H-pyrrolo[2,3-d]pyrimidin-4-yl)piperazine-1-carboximidamide
SMILES Cc1c[nH]c2ncnc(N3CCN(CC3)C(NC#N)=Nc3cccc(Br)c3)c12
InChI Key InChIKey=KXDMWKDZFFHEHC-UHFFFAOYSA-N
Data  1 IC50
  Tab Delimited (TSV)   2D SDfile   Computed 3D by Vconf -m prep SDfile
Find this compound or compounds like it in BindingDB:
Activity Spreadsheet -- Enzyme Inhibition Constant Data from BindingDB
Found 1 hit for monomerid = 50299598
TargetLIM domain kinase 2(Homo sapiens (Human))
Lexicon Pharmaceuticals
Curated by ChEMBL
LigandPNGBDBM50299598(CHEMBL568484 | N-(3-bromophenyl)-N'-cyano-4-(5-met...)
Affinity DataIC50:  11nM. Assay description: Inhibition of human recombinant LIMK2 expressed in baculovirus-Sf9 system by scintillation counting
In DepthDetails ArticlePubMed