BDBM50300131 CHEMBL575294::N-(4-bromophenylacetanoyl)-L-homoserine lactone
SMILES Brc1ccc(CC(=O)N[C@H]2CCOC2=O)cc1
InChI Key InChIKey=ARMCPRYGJUZWON-JTQLQIEISA-N
Data  5 IC50
  Tab Delimited (TSV)   2D SDfile   Computed 3D by Vconf -m prep SDfile
Find this compound or compounds like it in BindingDB:
Activity Spreadsheet -- Enzyme Inhibition Constant Data from BindingDB
Found 5 hits for monomerid = 50300131
TargetTranscriptional activator protein TraR(Rhizobium radiobacter)
Universidad De Cartagena-Facultad De Ciencias Exactas Y
Curated by ChEMBL
LigandPNGBDBM50300131(CHEMBL575294 | N-(4-bromophenylacetanoyl)-L-homose...)
Affinity DataIC50:  250nM. Assay description: Inhibition of Agrobacterium tumefaciens TraR
In DepthDetails ArticlePubMed
TargetTranscriptional activator protein LasR(Pseudomonas aeruginosa)
Universidad De Cartagena-Facultad De Ciencias Exactas Y
Curated by ChEMBL
LigandPNGBDBM50300131(CHEMBL575294 | N-(4-bromophenylacetanoyl)-L-homose...)
Affinity DataIC50:  1.61E+4nM. Assay description: Inhibition of Pseudomonas aeruginosa LasR
In DepthDetails ArticlePubMed
TargetTranscriptional activator protein LasR(Pseudomonas aeruginosa)
Universidad De Cartagena-Facultad De Ciencias Exactas Y
Curated by ChEMBL
LigandPNGBDBM50300131(CHEMBL575294 | N-(4-bromophenylacetanoyl)-L-homose...)
Affinity DataIC50:  1.16E+5nM. Assay description: Inhibition of LasR in Pseudomonas aeruginosa PAO-JP2 harboring plasI-LVAgfp incubated for 6 hrs by fluorescence method
In DepthDetails ArticlePubMed
TargetTranscriptional activator protein LuxR(Vibrio fischeri)
Larkin University
Curated by ChEMBL
LigandPNGBDBM50300131(CHEMBL575294 | N-(4-bromophenylacetanoyl)-L-homose...)
Affinity DataIC50:  3.70E+3nM. Assay description: Antagonist activity at Aliivibrio fischeri ES114 LuxR after 4 to 8 hrs by luminescence method
In DepthDetails ArticlePubMed
TargetTranscriptional activator protein LasR(Pseudomonas aeruginosa)
Universidad De Cartagena-Facultad De Ciencias Exactas Y
Curated by ChEMBL
LigandPNGBDBM50300131(CHEMBL575294 | N-(4-bromophenylacetanoyl)-L-homose...)
Affinity DataIC50:  1.48E+4nM. Assay description: Antagonist activity at GFP-fused LasR in Pseudomonas aeruginosa PAO-JP2 co-expressing LVAgfp plasmid by fluorescence assay
In DepthDetails ArticlePubMed