BDBM50300296 4-Amino-N-(3-chlorophenyl)-N'-hydroxy-1,2,5-oxadiazole-3-carboximidamide::CHEMBL579014
SMILES Nc1nonc1C(NO)=Nc1cccc(Cl)c1
InChI Key InChIKey=RUWUCFIAGRPKQM-UHFFFAOYSA-N
Data  3 IC50
  Tab Delimited (TSV)   2D SDfile   Computed 3D by Vconf -m prep SDfile
Find this compound or compounds like it in BindingDB:
Activity Spreadsheet -- Enzyme Inhibition Constant Data from BindingDB
Found 3 hits for monomerid = 50300296
TargetIndoleamine 2,3-dioxygenase 1(Homo sapiens (Human))
Macquarie University
Curated by ChEMBL
LigandPNGBDBM50300296(4-Amino-N-(3-chlorophenyl)-N'-hydroxy-1,2,5-oxadia...)
Affinity DataIC50:  86nM. Assay description: Inhibition of IDO1 by magnetic circular dichroism spectroscopic analysis
In DepthDetails ArticlePubMed
TargetIndoleamine 2,3-dioxygenase 1(Homo sapiens (Human))
Macquarie University
Curated by ChEMBL
LigandPNGBDBM50300296(4-Amino-N-(3-chlorophenyl)-N'-hydroxy-1,2,5-oxadia...)
Affinity DataIC50:  19nM. Assay description: Inhibition of indoleamine 2,3-dioxygenase in IFN-gamma-stimulated human HeLa cells assessed as kynurenine formation by spectrophotometry
In DepthDetails ArticlePubMed
TargetIndoleamine 2,3-dioxygenase 1(Homo sapiens (Human))
Macquarie University
Curated by ChEMBL
LigandPNGBDBM50300296(4-Amino-N-(3-chlorophenyl)-N'-hydroxy-1,2,5-oxadia...)
Affinity DataIC50:  86nM. Assay description: Inhibition of N-terminal his-tagged human indoleamine 2,3-dioxygenase expressed in Escherichia coli assessed as N'-formylkynurenine formation by spec...
In DepthDetails ArticlePubMed